2018-6-24 · 从txt文本复制出创建function的脚本,直接执行,然后报错:[Err] ORA-24344: success with compilation error。 突然发现脚本的关键字,居然不是高亮显示。 然后我把脚本前面的空格去掉,执 …

Compilation Error | The ASP.NET Forums 2008-10-22 Caused by: com.android.tools.r8 2018-6-11 · Caused by: com.android.tools.r8.CompilationFailedException: Compilation failed to complete Caused by: com.android.tools.r8.utils.AbortException AS 突然编译时,报以上异常:看报错日志,可能情况比较多: 若以下(1)(2)方式不起作用,则进行(3)方式 compilation 钩子 | webpack 中文网 2020-6-20 · Compilation 模块会被 Compiler 用来创建新的编译(或新的构建)。compilation 实例能够访问所有的模块和它们的依赖(大部分是循环依赖)。 它会对应用程序的依赖图中所有模块进行字面上的编译(literal compilation)。在编译阶段,模块会被加载(loaded)、封存 vivado hls 2018.2 opencv 'csim_design' failed: …

Feb 27, 2020 · Compilation Error: Length of String constant exceeds current memory limit. Printable View « Go Back. Information : Title: Compilation Error: Length of String

2019-5-26 · cc1: error: include location “/usr/include/” is unsafe for cross-compilation [-Werror=poison-system-directories] 很显然在交叉编译环境下,Makefile 中不应该出现 -I/usr/include/ 这样的参数,但它确实 …

Jul 19, 2019 · First you gotta locate your The Witcher 3 game install location. Usually it's somewhere like "C:\GOG Games\The Witcher 3 Wild Hunt GOTY" for Good Old Games versions of the game or "C:\Program Files (x86)\Steam\steamapps\common\The Witcher 3" for Steam versions of the game.

2020-7-21 · 1_481_9272_20580.cpp 1_481_9272_20580.cpp(34) : error C2668: “abs” : 对重载函数的调用不明确 \include\math.h(584): 可能是“long double abs(long Compilation error - Intel Community 2020-7-23 · Hi, Tushar. That device should be supported, but in order for it to show up in the pull-down menu in the "Device" block, you must have that device family installed in the Quartus version that you are using when you start DSP Builder with (in your case Quartus 18.0.1).